Target
40S ribosomal protein S27
Ligand
BDBM50361089
Substrate
Meas. Tech.
ChEMBL_795099 (CHEMBL1936525)
IC50
>10000±n/a nM
Citation
 Caruso, MValsasina, BBallinari, DBertrand, JBrasca, MGCaldarelli, MCappella, PFiorentini, FGianellini, LMScolaro, ABeria, I 5-(2-amino-pyrimidin-4-yl)-1H-pyrrole and 2-(2-amino-pyrimidin-4-yl)-1,5,6,7-tetrahydro-pyrrolo[3,2-c]pyridin-4-one derivatives as new classes of selective and orally available Polo-like kinase 1 inhibitors. Bioorg Med Chem Lett 22:96-101 (2011)  
Target
Name:
40S ribosomal protein S27
Synonyms:
MPS-1 Metallopan-stimulin 1 RS27_HUMAN
Type:
PROTEIN
Mol. Mass.:
9472.13
Organism:
Homo sapiens (Human)
Description:
ChEMBL_1446775
Residue:
84
  
Inhibitor
Name:
BDBM50361089
Synonyms:
CHEMBL1933576
Type:
Small organic molecule
Emp. Form.:
C22H24F3N7O2
Mol. Mass.:
475.4669
SMILES:
CN1CCN(CC1)c1ccc(OC(F)(F)F)c(Nc2nccc(n2)-c2cc(cn2C)C(N)=O)c1
: