Target
3-phosphoinositide-dependent protein kinase 1
Ligand
BDBM50361653
Substrate
Meas. Tech.
ChEMBL_799415 (CHEMBL1942167)
Ki
2±n/a nM
Citation
 Murphy, STAlton, GBailey, SBaxi, SMBurke, BJChappie, TAErmolieff, JFerre, RGreasley, SHickey, MHumphrey, JKablaoui, NKath, JKazmirski, SKraus, MKupchinsky, SLi, JLingardo, LMarx, MARichter, DTanis, SPTran, KVernier, WXie, ZYin, MJYu, XH Discovery of novel, potent, and selective inhibitors of 3-phosphoinositide-dependent kinase (PDK1). J Med Chem 54:8490-500 (2011)  
Target
Name:
3-phosphoinositide-dependent protein kinase 1
Synonyms:
3-Phosphoinositide-Dependent Protein Kinase 1 (PDK1) 3-phosphoinositide-dependent protein kinase 1 3-phosphoinositide-dependent protein kinase 1 (PDK-1) Isoform 2 of 3-phosphoinositide-dependent protein kinase 1 PDPK1 Phosphoinositide-dependent protein kinase 1 (PDK1) hPDK1
Type:
Enzyme
Mol. Mass.:
63157.65
Organism:
Homo sapiens (Human)
Description:
O15530
Residue:
556
  
Inhibitor
Name:
BDBM50361653
Synonyms:
CHEMBL1940245
Type:
Small organic molecule
Emp. Form.:
C25H27N7O
Mol. Mass.:
441.5282
SMILES:
CC(C)n1cc(C(=O)c2cncc(N[C@@H]3CCC[C@@H]3c3ccccc3)n2)c2c(N)ncnc12
: