Target
Beta-secretase 1
Ligand
BDBM50157439
Substrate
Meas. Tech.
ChEMBL_797665 (CHEMBL1943885)
IC50
8.2±n/a nM
Citation
 Hamada, YTagad, HDNishimura, YIshiura, SKiso, Y Tripeptidic BACE1 inhibitors devised by in-silico conformational structure-based design. Bioorg Med Chem Lett 22:1130-5 (2012)  
Target
Name:
Beta-secretase 1
Synonyms:
ASP2 Aspartyl protease 2 BACE1 Beta-secretase (BACE) Beta-secretase 1 (BACE 1) Beta-secretase 1 (BACE1) Beta-site amyloid precursor protein cleaving enzyme 1 Memapsin-2 beta-Secretase (BACE-1) | beta-Secretase (BACE1)
Type:
Protein
Mol. Mass.:
55755.10
Organism:
Homo sapiens (Human)
Description:
P56817
Residue:
501
  
Inhibitor
Name:
BDBM50157439
Synonyms:
3-((2R,3S)-3-((S)-2-((S)-2-((S)-2-amino-3-(2H-tetrazole-5-carboxamido)propanamido)-3-methylbutanamido)-4-methylpentanamido)-2-hydroxy-4-phenylbutanamido)benzoic acid CHEMBL183494
Type:
Small organic molecule
Emp. Form.:
C33H44N10O8
Mol. Mass.:
708.7647
SMILES:
CC(C)C[C@H](NC(=O)[C@@H](NC(=O)[C@@H](N)CNC(=O)c1nnn[nH]1)C(C)C)C(=O)N[C@@H](Cc1ccccc1)[C@@H](O)C(=O)Nc1cccc(c1)C(O)=O
: