Target
Neuropeptides B/W receptor type 1
Ligand
BDBM50362409
Substrate
Meas. Tech.
ChEMBL_797952 (CHEMBL1942829)
IC50
6±n/a nM
Citation
 Anthony Romero, FHastings, NBMoningka, RGuo, ZWang, MDi Salvo, JLei, YTrusca, DDeng, QTong, VTerebetski, JLBall, RGUjjainwalla, F The discovery of potent antagonists of NPBWR1 (GPR7). Bioorg Med Chem Lett 22:1014-8 (2012)  
Target
Name:
Neuropeptides B/W receptor type 1
Synonyms:
GPR7 NPBWR1 | neuropeptides B/W receptor 1
Type:
Enzyme Catalytic Domain
Mol. Mass.:
36111.82
Organism:
Homo sapiens (Human)
Description:
gi_119607128
Residue:
328
  
Inhibitor
Name:
BDBM50362409
Synonyms:
CHEMBL1940543
Type:
Small organic molecule
Emp. Form.:
C34H40N4O3S
Mol. Mass.:
584.771
SMILES:
COc1ccc(cc1)C1(CCC1)N[C@@H]1CC[C@@H]([C@H](C1)c1ccsc1)C(=O)N1CCN(CC1)c1nc2cc(C)ccc2o1
: