Target
2-dehydro-3-deoxyphosphooctonate aldolase
Ligand
BDBM50362547
Substrate
Meas. Tech.
ChEMBL_797884 (CHEMBL1942571)
Ki
1000000±n/a nM
Citation
 Harrison, ANReichau, SParker, EJ Synthesis and evaluation of tetrahedral intermediate mimic inhibitors of 3-deoxy-d-manno-octulosonate 8-phosphate synthase. Bioorg Med Chem Lett 22:907-11 (2012)  
Target
Name:
2-dehydro-3-deoxyphosphooctonate aldolase
Synonyms:
3-deoxy-D-manno-octulosonic acid 8-phosphate synthase KDO-8-phosphate synthase KDSA_NEIMB kdsA
Type:
PROTEIN
Mol. Mass.:
30484.01
Organism:
Neisseria meningitidis serogroup B (strain MC58)
Description:
ChEMBL_797884
Residue:
280
  
Inhibitor
Name:
BDBM50362547
Synonyms:
CHEMBL1941139
Type:
Small organic molecule
Emp. Form.:
C8H17O7P
Mol. Mass.:
256.1901
SMILES:
OCCCCCCC(OP(O)(O)=O)C(O)=O
: