Target
Sodium channel protein type 9 subunit alpha
Ligand
BDBM50117271
Substrate
Meas. Tech.
ChEMBL_797973 (CHEMBL1942850)
IC50
56000000±n/a nM
Citation
 Nguyen, HNBregman, HBuchanan, JLDu, BFeric, EHuang, LLi, XLigutti, JLiu, DMalmberg, ABMatson, DJMcDermott, JSPatel, VFWilenkin, BZou, AMcDonough, SIDimauro, EF Discovery and optimization of aminopyrimidinones as potent and state-dependent Nav1.7 antagonists. Bioorg Med Chem Lett 22:1055-60 (2012)  
Target
Name:
Sodium channel protein type 9 subunit alpha
Synonyms:
NENA Peripheral sodium channel 1 SCN9A_HUMAN Voltage-gated sodium channel subunit Nav1.7 hNE-Na
Type:
Protein
Mol. Mass.:
226375.97
Organism:
Homo sapiens (Human)
Description:
Q15858
Residue:
1988
  
Inhibitor
Name:
BDBM50117271
Synonyms:
1-(2,6-dimethylphenoxy)-2-propanolamine 2-(2,6-Dimethyl-phenoxy)-1-methyl-ethylamine CHEMBL558 Mexitil
Type:
Small organic molecule
Emp. Form.:
C11H17NO
Mol. Mass.:
179.2588
SMILES:
CC(N)COc1c(C)cccc1C
: