Target
Acyl-CoA desaturase 1
Ligand
BDBM50362592
Substrate
Meas. Tech.
ChEMBL_798097 (CHEMBL1943234)
IC50
3±n/a nM
Citation
 Lachance, NGareau, YGuiral, SHuang, ZIsabel, ELeclerc, JPLéger, SMartins, ENadeau, COballa, RMOuellet, SGPowell, DARamtohul, YKTranmer, GKTrinh, TWang, HZhang, L Discovery of potent and liver-targeted stearoyl-CoA desaturase (SCD) inhibitors in a bispyrrolidine series. Bioorg Med Chem Lett 22:980-4 (2012)  
Target
Name:
Acyl-CoA desaturase 1
Synonyms:
ACOD1_MOUSE | Scd1
Type:
PROTEIN
Mol. Mass.:
41064.54
Organism:
Mus musculus
Description:
ChEMBL_1462109
Residue:
355
  
Inhibitor
Name:
BDBM50362592
Synonyms:
CHEMBL1938870
Type:
Small organic molecule
Emp. Form.:
C17H16BrFN6O4
Mol. Mass.:
467.249
SMILES:
OC(=O)Cn1nnc(n1)-c1cc(no1)N1CCC(CC1)Oc1cc(F)ccc1Br
: