Target
Aldo-keto reductase family 1 member B1
Ligand
BDBM50362835
Substrate
Meas. Tech.
ChEMBL_798533 (CHEMBL1942330)
IC50
4900±n/a nM
Citation
 Soda, MHu, DEndo, STakemura, MLi, JWada, RIfuku, SZhao, HTEl-Kabbani, OOhta, SYamamura, KToyooka, NHara, AMatsunaga, T Design, synthesis and evaluation of caffeic acid phenethyl ester-based inhibitors targeting a selectivity pocket in the active site of human aldo-keto reductase 1B10. Eur J Med Chem 48:321-9 (2012)  
Target
Name:
Aldo-keto reductase family 1 member B1
Synonyms:
AKR1B1 ALDR_HUMAN AR Aldose Reductase (ALR2) Aldose reductase (AR)
Type:
Protein
Mol. Mass.:
35855.50
Organism:
Homo sapiens (Human)
Description:
P15121. 4LAU; 2IKI; 4LB4; 2FZD; 2FZ8; 1US0
Residue:
316
  
Inhibitor
Name:
BDBM50362835
Synonyms:
CHEMBL1940400
Type:
Small organic molecule
Emp. Form.:
C19H20O5
Mol. Mass.:
328.3591
SMILES:
COc1cc(O)ccc1\C=C\C(=O)OCCCc1cccc(O)c1
: