Target
RAF proto-oncogene serine/threonine-protein kinase
Ligand
BDBM50363398
Substrate
Meas. Tech.
ChEMBL_801444 (CHEMBL1948266)
IC50
3±n/a nM
Citation
 Zambon, ANiculescu-Duvaz, INiculescu-Duvaz, DMarais, RSpringer, CJ Small molecule inhibitors of BRAF in clinical trials. Bioorg Med Chem Lett 22:789-92 (2012)  
Target
Name:
RAF proto-oncogene serine/threonine-protein kinase
Synonyms:
C-Raf Protein Kinase RAF RAF1 Raf-1 Serine/threonine-protein kinase C-Raf | cRaf
Type:
Serine/threonine-protein kinase
Mol. Mass.:
73082.52
Organism:
Homo sapiens (Human)
Description:
P04049
Residue:
648
  
Inhibitor
Name:
BDBM50363398
Synonyms:
CHEMBL1946171
Type:
Small organic molecule
Emp. Form.:
C24H16F6N6O
Mol. Mass.:
518.4139
SMILES:
Cn1c(Nc2ccc(cc2)C(F)(F)F)nc2ccc(Oc3ccnc(c3)-c3c[nH]c(n3)C(F)(F)F)cc12
: