Target
Vascular endothelial growth factor receptor 2
Ligand
BDBM50363398
Substrate
Meas. Tech.
ChEMBL_801445 (CHEMBL1948267)
IC50
30±n/a nM
Citation
 Zambon, ANiculescu-Duvaz, INiculescu-Duvaz, DMarais, RSpringer, CJ Small molecule inhibitors of BRAF in clinical trials. Bioorg Med Chem Lett 22:789-92 (2012)  
Target
Name:
Vascular endothelial growth factor receptor 2
Synonyms:
CD_antigen=CD309 Fetal liver kinase 1 (FLK-1) KDR Protein-tyrosine kinase receptor Flk-1 VEGFR-2 VEGFR2 Vascular Endothelial Growth Factor Receptor Kinase 2 Vascular endothelial growth factor receptor 2 (KDR) Vascular endothelial growth factor receptor 2 (VEGFR2) Vascular endothelial growth factor receptor-2 (VEGFR-2)
Type:
Receptor Tyrosine Kinase
Mol. Mass.:
151510.97
Organism:
Homo sapiens (Human)
Description:
P35968
Residue:
1356
  
Inhibitor
Name:
BDBM50363398
Synonyms:
CHEMBL1946171
Type:
Small organic molecule
Emp. Form.:
C24H16F6N6O
Mol. Mass.:
518.4139
SMILES:
Cn1c(Nc2ccc(cc2)C(F)(F)F)nc2ccc(Oc3ccnc(c3)-c3c[nH]c(n3)C(F)(F)F)cc12
: