Target
Glycylpeptide N-tetradecanoyltransferase 1
Ligand
BDBM50364135
Substrate
Meas. Tech.
ChEMBL_803806 (CHEMBL1954201)
IC50
7±n/a nM
Citation
 Brand, SCleghorn, LAMcElroy, SPRobinson, DASmith, VCHallyburton, IHarrison, JRNorcross, NRSpinks, DBayliss, TNorval, SStojanovski, LTorrie, LSFrearson, JABrenk, RFairlamb, AHFerguson, MARead, KDWyatt, PGGilbert, IH Discovery of a novel class of orally active trypanocidal N-myristoyltransferase inhibitors. J Med Chem 55:140-52 (2012)  
Target
Name:
Glycylpeptide N-tetradecanoyltransferase 1
Synonyms:
Myristoyl-CoA:protein N-myristoyltransferase (Nmt) NMT NMT1_HUMAN Peptide N-myristoyltransferase 1
Type:
Enzyme
Mol. Mass.:
56814.10
Organism:
Homo sapiens (Human)
Description:
P30419
Residue:
496
  
Inhibitor
Name:
BDBM50364135
Synonyms:
CHEMBL1951295
Type:
Small organic molecule
Emp. Form.:
C24H29Cl2N5O2S
Mol. Mass.:
522.49
SMILES:
CN1CCN(Cc2cccc(c2)-c2cc(Cl)c(c(Cl)c2)S(=O)(=O)Nc2c(C)nn(C)c2C)CC1
: