Target
Bromodomain-containing protein 4
Ligand
BDBM50365263
Substrate
Meas. Tech.
ChEMBL_806301 (CHEMBL1959065)
Kd
640±n/a nM
Citation
 Filippakopoulos, PPicaud, SFedorov, OKeller, MWrobel, MMorgenstern, OBracher, FKnapp, S Benzodiazepines and benzotriazepines as protein interaction inhibitors targeting bromodomains of the BET family. Bioorg Med Chem 20:1878-86 (2012)  
Target
Name:
Bromodomain-containing protein 4
Synonyms:
BRD4 Bromodomain-containing protein 4 (BRD4) Protein HUNK1
Type:
Protein
Mol. Mass.:
152264.84
Organism:
Homo sapiens (Human)
Description:
O60885
Residue:
1362
  
Inhibitor
Name:
BDBM50365263
Synonyms:
CHEMBL1958337
Type:
Small organic molecule
Emp. Form.:
C17H14ClN5
Mol. Mass.:
323.78
SMILES:
CN1N=C(c2ccccc2)c2cc(Cl)ccc2-n2c(C)nnc12
: