Target
Matrix metalloproteinase-14
Ligand
BDBM50365344
Substrate
Meas. Tech.
ChEMBL_806647 (CHEMBL1960130)
Ki
>10000±n/a nM
Target
Name:
Matrix metalloproteinase-14
Synonyms:
MMP-14 MMP14 MT-MMP 1 MT1MMP Matrix Metalloproteinase-14 (MMP-14) Matrix metalloproteinase-14 Membrane-type matrix metalloproteinase 1 | Membrane-type-1 matrix metalloproteinase
Type:
Protein
Mol. Mass.:
65900.19
Organism:
Homo sapiens (Human)
Description:
P50281
Residue:
582
  
Inhibitor
Name:
BDBM50365344
Synonyms:
CHEMBL1956115
Type:
Small organic molecule
Emp. Form.:
C18H21NO4S
Mol. Mass.:
347.429
SMILES:
C[C@@](CCc1ccc(cc1)-c1ccccc1)(C(=O)NO)S(C)(=O)=O
: