Target
Sodium-dependent dopamine transporter
Ligand
BDBM50156055
Substrate
Meas. Tech.
ChEMBL_807237 (CHEMBL1960167)
IC50
4300±n/a nM
Citation
 Dunn, DHostetler, GIqbal, MMessina-McLaughlin, PReiboldt, ALin, YGGruner, JBacon, ERAtor, MAChatterjee, S Wake-promoting agents: search for next generation modafinil: part I. Bioorg Med Chem Lett 22:2312-4 (2012)  
Target
Name:
Sodium-dependent dopamine transporter
Synonyms:
DA transporter SC6A3_RAT Sodium-dependent dopamine transporter | Sodium-dependent dopamine transporter (DAT)
Type:
Multi-pass membrane protein
Mol. Mass.:
68749.45
Organism:
Rattus norvegicus (rat)
Description:
P23977
Residue:
619
  
Inhibitor
Name:
BDBM50156055
Synonyms:
2-(Diphenyl-methanesulfinyl)-acetamide 2-[(diphenylmethyl)sulfinyl]acetamide CEP-1538 CRL-40476 Provigil US11555013, Compound (+-)-modafinilb | US9862679, Compound (+-)-modafinil
Type:
Small organic molecule
Emp. Form.:
C15H15NO2S
Mol. Mass.:
273.35
SMILES:
NC(=O)CS(=O)C(c1ccccc1)c1ccccc1
: