Target
Tubulin alpha-1A chain
Ligand
BDBM50014846
Substrate
Meas. Tech.
ChEBML_212015
IC50
1500±n/a nM
Citation
 Hodgson, STCon Jenkins, DKnick, VRapson, EWatts, SD Synthesis and biological properties of 1069C: a new synthetic antitumour agent with very low cross-resistance potential Bioorg Med Chem Lett 2:1257-1262 (1992)    Article 
Target
Name:
Tubulin alpha-1A chain
Synonyms:
TBA1A_PIG Tubulin Tubulin alpha-1A chain
Type:
Protein
Mol. Mass.:
50049.25
Organism:
Sus scrofa (Pig)
Description:
P02550
Residue:
451
  
Inhibitor
Name:
BDBM50014846
Synonyms:
(S)-N-(5,6,7,9-tetrahydro-1,2,3,10-tetramethoxy-9-oxobenzo[a]heptalen-7-yl)acetamide 7alphaH-colchicine COLCHICINE colchicina | colchicinum
Type:
Small organic molecule
Emp. Form.:
C22H25NO6
Mol. Mass.:
399.437
SMILES:
COc1cc2CC[C@H](NC(C)=O)c3cc(=O)c(OC)ccc3-c2c(OC)c1OC
: