Target
3-phosphoshikimate 1-carboxyvinyltransferase
Ligand
BDBM50280241
Substrate
Meas. Tech.
ChEMBL_65092 (CHEMBL673149)
Ki
85000±n/a nM
Citation
 Marzabadi, MRFont, JLGruys, KJPansegrau, PDSikorski, JA Design & synthesis of a novel EPSP synthase inhibitor based on its ternary complex with shikimate-3-phosphate and glyphosate Bioorg Med Chem Lett 2:1435-1440 (1992)    Article 
Target
Name:
3-phosphoshikimate 1-carboxyvinyltransferase
Synonyms:
5-enolpyruvylshikimate-3-phosphate synthase aroA
Type:
PROTEIN
Mol. Mass.:
46089.22
Organism:
Escherichia coli (strain K12)
Description:
ChEMBL_65087
Residue:
427
  
Inhibitor
Name:
BDBM50280241
Synonyms:
(3R,4S,5R)-5-amino-4-hydroxy-3-(phosphonatooxy)cyclohex-1-ene-1-carboxylate
Type:
Small organic molecule
Emp. Form.:
C7H9NO7P
Mol. Mass.:
250.1243
SMILES:
N[C@@H]1CC(=C[C@@H](OP([O-])([O-])=O)[C@H]1O)C([O-])=O
: