Target
Acetylcholinesterase
Ligand
BDBM50004000
Substrate
Meas. Tech.
ChEBML_28125
IC50
1±n/a nM
Citation
 Ares, JJRonkin, SMWallace, LJ Synthesis of 1-(2-Indolyl)pyridinium salts: a prodrug approach to acetylcholinesterase inhibition Bioorg Med Chem Lett 2:123-126 (1992)    Article 
Target
Name:
Acetylcholinesterase
Synonyms:
ACES_ELEEL Acetylcholinesterase (EeAChE) | ache
Type:
Enzyme
Mol. Mass.:
71812.79
Organism:
Electrophorus electricus (Electric eel)
Description:
Residue:
633
  
Inhibitor
Name:
BDBM50004000
Synonyms:
(3aS,8aR)-1,3a,8-trimethyl-1,2,3,3a,8,8a-hexahydropyrrolo[2,3-b]indol-5-yl methylcarbamate CHEMBL94 Physostol | physostigmine
Type:
Small organic molecule
Emp. Form.:
C15H21N3O2
Mol. Mass.:
275.3461
SMILES:
CNC(=O)Oc1ccc2N(C)[C@H]3N(C)CC[C@@]3(C)c2c1
: