Target
Neprilysin
Ligand
BDBM21642
Substrate
Meas. Tech.
ChEBML_144599
IC50
830000±n/a nM
Citation
 Delaney, NGBarrish, JCNeubeck, RNatarajan, SCohen, MRovnyak, GCHuber, GMurugesan, NGirotra, RSieber-McMaster, ERobl, JAAsaad, MMCheung, HSBird, JWaldron, TPetrillo, EW Mercaptoacyl dipeptides as dual inhibitors of angiotensin-converting enzyme and neutral endopeptidase. Preliminary structure-activity studies Bioorg Med Chem Lett 4:1783-1788 (1994)    Article 
Target
Name:
Neprilysin
Synonyms:
Mme Neprilysin Neutral endopeptidase 24.11
Type:
Protein
Mol. Mass.:
85789.59
Organism:
Rattus norvegicus (Rat)
Description:
P07861
Residue:
750
  
Inhibitor
Name:
BDBM21642
Synonyms:
(2S)-1-[(2S)-2-methyl-3-sulfanylpropanoyl]pyrrolidine-2-carboxylic acid Capozide Lopirin SQ14534 | US11491146, Compound L-Captopril
Type:
Small organic molecule
Emp. Form.:
C9H15NO3S
Mol. Mass.:
217.285
SMILES:
C[C@H](CS)C(=O)N1CCC[C@H]1C(O)=O
: