Target
Sodium-dependent dopamine transporter
Ligand
BDBM22418
Substrate
Meas. Tech.
ChEMBL_62470 (CHEMBL679107)
Ki
280±n/a nM
Citation
 Stoelwinder, JRoberti, MKozikowski, APJohnson, KMBergmann, JS Differential binding and dopamine uptake activity of cocaine analogues modified at nitrogen Bioorg Med Chem Lett 4:303-308 (1994)    Article 
Target
Name:
Sodium-dependent dopamine transporter
Synonyms:
DA transporter SC6A3_RAT Sodium-dependent dopamine transporter | Sodium-dependent dopamine transporter (DAT)
Type:
Multi-pass membrane protein
Mol. Mass.:
68749.45
Organism:
Rattus norvegicus (rat)
Description:
P23977
Residue:
619
  
Inhibitor
Name:
BDBM22418
Synonyms:
Cocaine methyl (1R,2R,3S,5S)-3-(benzoyloxy)-8-methyl-8-azabicyclo[3.2.1]octane-2-carboxylate | methyl (1R,2R,3S,5S)-8-methyl-3-[(phenylcarbonyl)oxy]-8-azabicyclo[3.2.1]octane-2-carboxylate
Type:
Emp. Form.:
C17H21NO4
Mol. Mass.:
303.3529
SMILES:
[H][C@]12CC[C@]([H])([C@H]([C@H](C1)OC(=O)c1ccccc1)C(=O)OC)N2C
: