Target
3-phosphoshikimate 1-carboxyvinyltransferase
Ligand
BDBM50283578
Substrate
Meas. Tech.
ChEMBL_64948 (CHEMBL675693)
IC50
100000±n/a nM
Citation
 Miller, MJBraccolino, DSClearly, DGReam, JEWalker, MCSikorski, JA EPSP synthase inhibitor design IV. New aromatic substrate analogs and symmetrical inhibitors containing novel 3-phosphate mimics. Bioorg Med Chem Lett 4:2605-2608 (1994)    Article 
Target
Name:
3-phosphoshikimate 1-carboxyvinyltransferase
Synonyms:
5-enolpyruvylshikimate-3-phosphate synthase aroA
Type:
PROTEIN
Mol. Mass.:
46089.22
Organism:
Escherichia coli (strain K12)
Description:
ChEMBL_65087
Residue:
427
  
Inhibitor
Name:
BDBM50283578
Synonyms:
(3R,4R,5R)-5-Carboxymethoxy-4-hydroxy-3-phosphonooxy-cyclohex-1-enecarboxylic acid; trisodium salt | CHEMBL88396
Type:
Small organic molecule
Emp. Form.:
C9H10O10P
Mol. Mass.:
309.1451
SMILES:
O[C@@H]1[C@@H](CC(=C[C@H]1OP(O)([O-])=O)C([O-])=O)OCC([O-])=O
: