Target
Protein tyrosine phosphatase receptor type C-associated protein
Ligand
BDBM50202301
Substrate
Meas. Tech.
ChEBML_210870
IC50
182000±n/a nM
Citation
 Miski, MXing, ShenCooper, RGillum, AMFisher, DKMiller, RWHiggins, TJ Aporphine alkaloids, CD45 protein tyrosine phosphatase inhibitors, from Rollinia ulei Bioorg Med Chem Lett 5:1519-1522 (1995)    Article 
Target
Name:
Protein tyrosine phosphatase receptor type C-associated protein
Synonyms:
CD45-AP LPAP PTCA_HUMAN PTPRCAP
Type:
PROTEIN
Mol. Mass.:
21182.08
Organism:
Homo sapiens (Human)
Description:
ChEMBL_210870
Residue:
206
  
Inhibitor
Name:
BDBM50202301
Synonyms:
CHEMBL37736 hiriodenine
Type:
Small organic molecule
Emp. Form.:
C17H9NO3
Mol. Mass.:
275.2583
SMILES:
O=C1c2ccccc2-c2c3OCOc3cc3ccnc1c23
: