Target
Xaa-Pro dipeptidase
Ligand
BDBM50366413
Substrate
Meas. Tech.
ChEMBL_159887 (CHEMBL769532)
pH
6±n/a
Ki
8.5±n/a nM
Comments
extracted
Citation
 Mock, WLLiu, Y Inhibition of prolidase by phosphoenolpyruvate is biphasic. avoidance of endogenous-metabolite inactivation by cooperativity within an enzyme dimer Bioorg Med Chem Lett 5:627-630 (1995)    Article 
Target
Name:
Xaa-Pro dipeptidase
Synonyms:
PEPD PRD
Type:
PROTEIN
Mol. Mass.:
54541.05
Organism:
Homo sapiens (Human)
Description:
ChEMBL_159887
Residue:
493
  
Inhibitor
Name:
BDBM50366413
Synonyms:
PHOSPHOENOLPYRUVATE
Type:
Small organic molecule
Emp. Form.:
C3H5O6P
Mol. Mass.:
168.042
SMILES:
OC(=O)C(=C)OP(O)(O)=O
: