Target
Serine protease 1
Ligand
BDBM10458
Substrate
Meas. Tech.
ChEBML_212327
pH
7.5±n/a
Ki
>2000000±n/a nM
Comments
extracted
Citation
 von der Saal, WKucznierz, RLeinert, HEngh, RA DERIVATIVES OF 4-AMINO-PYRIDINE AS SELECTIVE THROMBIN INHIBITORS Bioorg Med Chem Lett 7:1283-1288 (1997)    Article 
Target
Name:
Serine protease 1
Synonyms:
Beta-Trypsin PRSS1 TRY1 TRYP1 Trypsin I
Type:
Enzyme
Mol. Mass.:
25790.52
Organism:
Bos taurus (bovine)
Description:
P00760
Residue:
246
  
Inhibitor
Name:
BDBM10458
Synonyms:
4-AP CHEMBL284348 pyridin-4-amine
Type:
Small organic molecule
Emp. Form.:
C5H6N2
Mol. Mass.:
94.1145
SMILES:
Nc1ccncc1
: