Target
Kynurenine 3-monooxygenase
Ligand
BDBM50072260
Substrate
Meas. Tech.
ChEMBL_216337 (CHEMBL818751)
IC50
950±n/a nM
Citation
 Giordani, APevarello, PCini, MBormetti, RGreco, FToma, SSpeciale, CVarasi, M 4-Phenyl-4-oxo-butanoic acid derivatives inhibitors of kynurenine 3-hydroxylase. Bioorg Med Chem Lett 8:2907-12 (1999)  
Target
Name:
Kynurenine 3-monooxygenase
Synonyms:
KMO_RAT | Kmo
Type:
PROTEIN
Mol. Mass.:
54371.88
Organism:
Rattus norvegicus
Description:
ChEMBL_1487468
Residue:
478
  
Inhibitor
Name:
BDBM50072260
Synonyms:
(Z)-4-(3,4-Dichloro-phenyl)-2-hydroxy-4-oxo-but-2-enoic acid CHEMBL22480
Type:
Small organic molecule
Emp. Form.:
C10H6Cl2O4
Mol. Mass.:
261.058
SMILES:
OC(=O)C(=O)CC(=O)c1ccc(Cl)c(Cl)c1
: