Target
Aminopeptidase N
Ligand
BDBM50078122
Substrate
Meas. Tech.
ChEMBL_35499 (CHEMBL646409)
Ki
0.000±n/a nM
Comments
Zero 01/04/22
Citation
 Chen, HRoques, BPFournié-Zaluski, MC Design of the first highly potent and selective aminopeptidase N (EC 3.4.11.2) inhibitor. Bioorg Med Chem Lett 9:1511-6 (1999)  
Target
Name:
Aminopeptidase N
Synonyms:
AMPN_PIG AP-M Alanyl aminopeptidase Aminopeptidase N (APN) Microsomal aminopeptidase pAPN
Type:
Protein
Mol. Mass.:
108810.25
Organism:
Sus scrofa (Pig)
Description:
P15145
Residue:
963
  
Inhibitor
Name:
BDBM50078122
Synonyms:
(R)-1-{[(S)-2-((S)-1-Carboxy-1-methyl-2-phenyl-ethylcarbamoyl)-3-phenyl-propyl]-hydroxy-phosphinoyl}-2-phenyl-ethyl-ammonium
Type:
Small organic molecule
Emp. Form.:
C28H34N2O5P
Mol. Mass.:
509.5532
SMILES:
C[C@@](Cc1ccccc1)(NC(=O)[C@H](Cc1ccccc1)CP(O)(=O)[C@@H]([NH3+])Cc1ccccc1)C(O)=O
: