Target
Steryl-sulfatase
Ligand
BDBM50134329
Substrate
Meas. Tech.
ChEBML_68015
IC50
0.065±n/a nM
Citation
 Ahmed, SJames, K Derivation of a possible transition-state for the reaction catalysed by the enzyme estrone Sulfatase (ES). Bioorg Med Chem Lett 9:1645-50 (1999)  
Target
Name:
Steryl-sulfatase
Synonyms:
ARSC1 Arylsulfatase C STS_HUMAN Steryl-sulfate sulfohydrolase
Type:
Enzyme
Mol. Mass.:
65503.66
Organism:
Homo sapiens (Human)
Description:
P08842
Residue:
583
  
Inhibitor
Name:
BDBM50134329
Synonyms:
CHEMBL122708 Sulfamic acid (8R,9S,13S,14S)-13-methyl-17-oxo-7,8,9,11,12,13,14,15,16,17-decahydro-6H-cyclopenta[a]phenanthren-3-yl ester estrone3-O-sulfamate
Type:
Small organic molecule
Emp. Form.:
C18H23NO4S
Mol. Mass.:
349.445
SMILES:
C[C@]12CC[C@H]3[C@@H](CCc4cc(OS(N)(=O)=O)ccc34)[C@@H]1CCC2=O
: