Target
Sodium channel protein type 1/2/3 subunit alpha
Ligand
BDBM50031299
Substrate
Meas. Tech.
ChEMBL_202556 (CHEMBL804529)
IC50
>100000±n/a nM
Citation
 Pevarello, PBonsignori, ACaccia, CAmici, RMcArthur, RAFariello, RGSalvati, PVarasi, M Sodium channel activity and sigma binding of 2-aminopropanamide anticonvulsants. Bioorg Med Chem Lett 9:2521-4 (1999)  
Target
Name:
Sodium channel protein type 1/2/3 subunit alpha
Synonyms:
Sodium channel alpha subunits; brain (Types I, II, III) | Sodium channel protein type I I alpha subunit
Type:
Mol. Mass.:
Description:
ASSAY_ID of EBI is 202416
Components:
This complex has 3 components.
Component 1
Name:
Sodium channel protein type 1 subunit alpha
Synonyms:
SCN1A_RAT Sodium (Site 1) Sodium channel protein type I alpha subunit Sodium channel protein, brain I subunit alpha Voltage-gated sodium channel subunit alpha Nav1.1
Type:
PROTEIN
Mol. Mass.:
228753.20
Organism:
Rattus norvegicus
Description:
ChEMBL_938840
Residue:
2009
  
Component 2
Name:
Sodium channel protein type 2 subunit alpha
Synonyms:
SCN2A_RAT Scn2a1 Sodium channel protein type 2 subunit alpha Sodium channel protein type II subunit alpha Voltage-gated sodium channel | Voltage-gated sodium channel subunit alpha Nav1.2
Type:
PROTEIN
Mol. Mass.:
227854.11
Organism:
Rattus norvegicus
Description:
ChEMBL_1516893
Residue:
2005
  
Component 3
Name:
Sodium channel protein type 3 subunit alpha
Synonyms:
SCN3A_RAT Sodium channel protein type 3 subunit alpha Sodium channel protein type III subunit alpha Voltage-gated sodium channel Voltage-gated sodium channel subunit alpha Nav1.3
Type:
PROTEIN
Mol. Mass.:
221371.72
Organism:
Rattus norvegicus
Description:
ChEMBL_1516894
Residue:
1951
  
Inhibitor
Name:
BDBM50031299
Synonyms:
6-(2,3-Dichloro-phenyl)-[1,2,4]triazine-3,5-diamine 6-(2,3-dichlorophenyl)-1,2,4-triazine-3,5-diamine CHEMBL741 Lamictal | Lamictal cd
Type:
Small organic molecule
Emp. Form.:
C9H7Cl2N5
Mol. Mass.:
256.091
SMILES:
Nc1nnc(c(N)n1)-c1cccc(Cl)c1Cl
: