Target
DNA topoisomerase 1
Ligand
BDBM50081429
Substrate
Meas. Tech.
ChEBML_208411
IC50
63000±n/a nM
Citation
 Sato, SSuga, YYoshimura, TNakagawa, RTsuji, TUmemura, KAndoh, T Syntheses of novel antitumor dihydroxanthone derivatives with inhibitory activity against DNA topoisomerase II. Bioorg Med Chem Lett 9:2653-6 (1999)  
Target
Name:
DNA topoisomerase 1
Synonyms:
DNA topoisomerase I Top-1 | Top1
Type:
PROTEIN
Mol. Mass.:
90922.04
Organism:
Mus musculus
Description:
ChEMBL_208411
Residue:
767
  
Inhibitor
Name:
BDBM50081429
Synonyms:
(4R,4aS)-4,8-Dihydroxy-6-methyl-9-oxo-4,9-dihydro-xanthene-4a-carboxylic acid amide | CHEMBL88409
Type:
Small organic molecule
Emp. Form.:
C15H13NO5
Mol. Mass.:
287.2674
SMILES:
Cc1cc(O)c2C(=O)C3=CC=C[C@@H](O)[C@]3(Oc2c1)C(N)=O
: