Target
Sodium-dependent dopamine transporter
Ligand
BDBM50083617
Substrate
Meas. Tech.
ChEMBL_62638 (CHEMBL676683)
Ki
26±n/a nM
Citation
 Prakash, KRTamiz, APAraldi, GLZhang, MJohnson, KMKozikowski, AP N-phenylalkyl-substituted tropane analogs of boat conformation with high selectivity for the dopamine versus serotonin transporter. Bioorg Med Chem Lett 9:3325-8 (2000)  
Target
Name:
Sodium-dependent dopamine transporter
Synonyms:
DA transporter SC6A3_RAT Sodium-dependent dopamine transporter | Sodium-dependent dopamine transporter (DAT)
Type:
Multi-pass membrane protein
Mol. Mass.:
68749.45
Organism:
Rattus norvegicus (rat)
Description:
P23977
Residue:
619
  
Inhibitor
Name:
BDBM50083617
Synonyms:
(3R,8R)-2,3-Bis-(4-fluoro-phenyl)-8-phenethyl-8-aza-bicyclo[3.2.1]octane
Type:
Small organic molecule
Emp. Form.:
C27H27F2N
Mol. Mass.:
403.5068
SMILES:
Fc1ccc(cc1)[C@@H]1CC2CCC(C1c1ccc(F)cc1)N2CCc1ccccc1
: