Target
Lysosomal alpha-glucosidase
Ligand
BDBM50350757
Substrate
Meas. Tech.
ChEBML_33934
Ki
86000±n/a nM
Citation
 Schuster, M Homoisofagomines: chemical-enzymatic synthesis and evaluation as alpha- and beta-glucosidase inhibitors. Bioorg Med Chem Lett 9:615-8 (1999)  
Target
Name:
Lysosomal alpha-glucosidase
Synonyms:
70 kDa lysosomal alpha-glucosidase Acid maltase Alpha glucosidase LYAG_HUMAN
Type:
PROTEIN
Mol. Mass.:
105312.45
Organism:
Homo sapiens (Human)
Description:
ChEMBL_1506060
Residue:
952
  
Inhibitor
Name:
BDBM50350757
Synonyms:
CHEMBL1818432
Type:
Small organic molecule
Emp. Form.:
C6H13NO3
Mol. Mass.:
147.1723
SMILES:
OC[C@@H]1CNC[C@@H](O)[C@@H]1O
: