Target
D(2) dopamine receptor
Ligand
BDBM50088754
Substrate
Meas. Tech.
ChEBML_61447
Ki
549±n/a nM
Citation
 Tamagnan, GBaldwin, RMKula, NSBaldessarini, RJInnis, RB Cyclopentadienyltricarbonylrheniumbenzazepines: synthesis and binding affinity. Bioorg Med Chem Lett 10:1113-5 (2000)  
Target
Name:
D(2) dopamine receptor
Synonyms:
DOPAMINE D2 Dopamine D2 receptor Drd2
Type:
Enzyme
Mol. Mass.:
50957.64
Organism:
Mus musculus (Mouse)
Description:
P61168
Residue:
444
  
Inhibitor
Name:
BDBM50088754
Synonyms:
CHEMBL274577 | Cyclopentadienyltricarbonylrheniumbenzazepine (2`-CPTR-SCH-23390)
Type:
Small organic molecule
Emp. Form.:
C26H24ClNO5Re
Mol. Mass.:
652.132
SMILES:
CN1CCc2cc(Cl)c(O)cc2C(C1)c1ccccc1C(=O)C1=CC=C[C@@H]1[Re](C=O)(C=O)C=O
: