Target
Adenosine transporter 1
Ligand
BDBM50366636
Substrate
Meas. Tech.
ChEBML_31141
Ki
3470±n/a nM
Citation
 Soulère, LHoffmann, PBringaud, FPérié, J Synthesis and uptake of nitric oxide-releasing drugs by the P2 nucleoside transporter in Trypanosoma equiperdum. Bioorg Med Chem Lett 10:1347-50 (2000)  
Target
Name:
Adenosine transporter 1
Synonyms:
Type:
PROTEIN
Mol. Mass.:
51044.02
Organism:
Trypanosoma brucei
Description:
ChEMBL_31141
Residue:
463
  
Inhibitor
Name:
BDBM50366636
Synonyms:
CHEMBL605462
Type:
Small organic molecule
Emp. Form.:
C17H24N8O6S
Mol. Mass.:
468.487
SMILES:
CC(=O)NC(C(=O)NC[C@H]1OC([C@H](O)[C@@H]1O)n1cnc2c(N)ncnc12)C(C)(C)SN=O
: