Target
Glutamate receptor ionotropic, kainate 2
Ligand
BDBM17657
Substrate
Meas. Tech.
ChEMBL_90455 (CHEMBL699990)
Ki
1106±n/a nM
Citation
 Baker, SRBleakman, DEzquerra, JBallyk, BADeverill, MHo, KKamboj, RKCollado, IDomínguez, CEscribano, AMateo, AIPedregal, CRubio, A 4-Alkylidenyl glutamic acids, potent and selective GluR5 agonists. Bioorg Med Chem Lett 10:1807-10 (2000)  
Target
Name:
Glutamate receptor ionotropic, kainate 2
Synonyms:
EAA4 GLUR6 GRIK2_HUMAN GluR-6 Glutamate receptor 6 Glutamate receptor, ionotropic kainate 2 Glutamate-Kainate, GluR6
Type:
Enzyme Catalytic Domain
Mol. Mass.:
102592.78
Organism:
Homo sapiens (Human)
Description:
Q13002
Residue:
908
  
Inhibitor
Name:
BDBM17657
Synonyms:
(2S)-2-aminopentanedioic acid D-Glutamate L-Glu L-Glutamic acid L-gluatmate
Type:
Amino Acid
Emp. Form.:
C5H9NO4
Mol. Mass.:
147.1293
SMILES:
N[C@@H](CCC(O)=O)C(O)=O
: