Target
Estrogen receptor beta
Ligand
BDBM50169743
Substrate
Meas. Tech.
ChEBML_67812
IC50
7±n/a nM
Citation
 Miller, CPJirkovsky, ITran, BDHarris, HAMoran, RAKomm, BS Synthesis and estrogenic activities of novel 7-thiosubstituted estratriene derivatives. Bioorg Med Chem Lett 10:147-51 (2000)  
Target
Name:
Estrogen receptor beta
Synonyms:
ER-beta ESR2_HUMAN Estradiol receptor beta (ERβ) Estrogen receptor (ER beta) Estrogen receptor beta (ER beta) NR3A2 estrogen beta
Type:
Protein
Mol. Mass.:
59238.43
Organism:
Homo sapiens (Human)
Description:
Q92731
Residue:
530
  
Inhibitor
Name:
BDBM50169743
Synonyms:
(13S,17S)-13-Methyl-7-[9-(4,4,5,5,5-pentafluoro-pentane-1-sulfinyl)-nonyl]-7,8,9,11,12,13,14,15,16,17-decahydro-6H-cyclopenta[a]phenanthrene-3,17-diol (7R,13S,17S)-13-methyl-7-(9-(4,4,5,5,5-pentafluoropentylsulfinyl)nonyl)-7,8,9,11,12,13,14,15,16,17-decahydro-6H-cyclopenta[a]phenanthrene-3,17-diol (7R,8R,9S,13S,14S,17S)-13-methyl-7-(9-(4,4,5,5,5-pentafluoropentyldihydrosulfinyl)nonyl)-7,8,9,11,12,13,14,15,16,17-decahydro-6H-cyclopenta[a]phenanthrene-3,17-diol 13-Methyl-7-[9-(4,4,5,5,5-pentafluoro-pentane-1-sulfinyl)-nonyl]-7,8,9,11,12,13,14,15,16,17-decahydro-6H-cyclopenta[a]phenanthrene-3,17-diol FULVESTRANT Fluvestrant US10227334, Fulvestrant | ZD-9238
Type:
Small organic molecule
Emp. Form.:
C32H47F5O3S
Mol. Mass.:
606.771
SMILES:
C[C@]12CC[C@H]3[C@H]([C@@H]1CC[C@@H]2O)[C@H](CCCCCCCCCS(=O)CCCC(F)(F)C(F)(F)F)Cc1cc(O)ccc31
: