Target
Excitatory amino acid transporter 2
Ligand
BDBM50093753
Substrate
Meas. Tech.
ChEMBL_68327 (CHEMBL680698)
IC50
221000±n/a nM
Citation
 Shimamoto, KShigeri, YYasuda-Kamatani, YLebrun, BYumoto, NNakajima, T Syntheses of optically pure beta-hydroxyaspartate derivatives as glutamate transporter blockers. Bioorg Med Chem Lett 10:2407-10 (2001)  
Target
Name:
Excitatory amino acid transporter 2
Synonyms:
EAA2_HUMAN GLT1 SLC1A2 Solute carrier family 1 member 2
Type:
Enzyme Catalytic Domain
Mol. Mass.:
62103.57
Organism:
Homo sapiens (Human)
Description:
Excitatory Amino Acid EAAT2 0 0::P43004
Residue:
574
  
Inhibitor
Name:
BDBM50093753
Synonyms:
(2S,3S)-2-Amino-3-benzyloxy-succinic acid (3S)-3-(BENZYLOXY)-L-ASPARTIC ACID DL-TBOA
Type:
Small organic molecule
Emp. Form.:
C11H13NO5
Mol. Mass.:
239.2246
SMILES:
N[C@@H]([C@H](OCc1ccccc1)C(O)=O)C(O)=O
: