Target
Vacuolar proton pump subunit B
Ligand
BDBM50086849
Substrate
Meas. Tech.
ChEBML_148285
IC50
4900±n/a nM
Citation
 Edvinsson, KMHerslöf, MHolm, PKann, NKeeling, DJMattsson, JPNordén, BShcherbukhin, V Solid phase synthesis of diamides as potential bone resorption inhibitors. Bioorg Med Chem Lett 10:503-7 (2000)  
Target
Name:
Vacuolar proton pump subunit B
Synonyms:
Adenosinetriphosphatase Vacuolar H-ATPase B subunit osteoclast isozyme
Type:
PROTEIN
Mol. Mass.:
55043.78
Organism:
Gallus gallus
Description:
ChEMBL_148284
Residue:
496
  
Inhibitor
Name:
BDBM50086849
Synonyms:
3-[(3,4-Dichloro-phenylcarbamoyl)-methyl]-N-(2,2,6,6-tetramethyl-piperidin-4-yl)-benzamide | CHEMBL147307
Type:
Small organic molecule
Emp. Form.:
C24H29Cl2N3O2
Mol. Mass.:
462.412
SMILES:
CC1(C)CC(CC(C)(C)N1)NC(=O)c1cccc(CC(=O)Nc2ccc(Cl)c(Cl)c2)c1
: