Target
1,3-beta-glucan synthase
Ligand
BDBM50100329
Substrate
Meas. Tech.
ChEBML_39039
IC50
0.890000±n/a nM
Citation
 Masubuchi, KOkada, TKohchi, MMurata, TTsukazaki, MKondoh, OYamazaki, TSatoh, YOno, YTsukaguchi, TKobayashi, KOno, NInoue, THorii, IShimma, N Synthesis and antifungal activities of novel 1,3-beta-D-glucan synthase inhibitors. Part 2. Bioorg Med Chem Lett 11:1273-6 (2001)  
Target
Name:
1,3-beta-glucan synthase
Synonyms:
1,3-beta-glucan synthase Glucan Synthase
Type:
Enzyme
Mol. Mass.:
218006.59
Organism:
Candida albicans (Yeast)
Description:
O13428
Residue:
1897
  
Inhibitor
Name:
BDBM50100329
Synonyms:
CHEMBL2371727 | RO-09-3655 derivative
Type:
Small organic molecule
Emp. Form.:
C79H133N17O24
Mol. Mass.:
1705.0008
SMILES:
[H][C@@]12C[C@@H](O)CN1C(=O)[C@@H](NC(=O)[C@H](Cc1ccc(O)cc1)NC(=O)[C@@H](C)NC(=O)[C@@]([H])(NC(=O)C[C@@H](CCCCCCCCCCCCC)OC(=O)[C@H](CCCN(CCCN)C(=O)[C@@H](N)CCCN)NC(=O)[C@@]([H])(NC(=O)CNC(=O)[C@@]([H])(NC(=O)[C@]1([H])[C@@H](O)CCN1C(=O)[C@@]([H])(NC(=O)[C@@]([H])(NC2=O)[C@@H](C)O)[C@@H](C)O)[C@H](O)CC(N)=O)[C@@H](C)O)[C@@H](C)O)C(C)C
: