Target
3-oxo-5-alpha-steroid 4-dehydrogenase 1
Ligand
BDBM50218784
Substrate
Meas. Tech.
ChEMBL_205216 (CHEMBL816490)
IC50
>18400±n/a nM
Citation
 Fan, GMar, WPark, MKChoi, EWKim, KKim, S A novel class of inhibitors for steroid 5alpha-reductase: synthesis and evaluation of umbelliferone derivatives. Bioorg Med Chem Lett 11:2361-3 (2001)  
Target
Name:
3-oxo-5-alpha-steroid 4-dehydrogenase 1
Synonyms:
3-oxo-5-alpha-steroid 4-dehydrogenase 1 S5A1_HUMAN SR type 1 Steroid 5-alpha-reductase | Steroid 5-alpha-reductase 1
Type:
Enzyme
Mol. Mass.:
29472.80
Organism:
Homo sapiens (Human)
Description:
P18405
Residue:
259
  
Inhibitor
Name:
BDBM50218784
Synonyms:
CHEMBL80175
Type:
Small organic molecule
Emp. Form.:
C13H12O3
Mol. Mass.:
216.2326
SMILES:
COc1ccc2ccc(=O)oc2c1CC=C
: