Target
Carbonic anhydrase 4
Ligand
BDBM10885
Substrate
Meas. Tech.
ChEMBL_45266 (CHEMBL658218)
Ki
45±n/a nM
Citation
 Scozzafava, ASupuran, CT Carbonic anhydrase inhibitors. Preparation of potent sulfonamides inhibitors incorporating bile acid tails. Bioorg Med Chem Lett 12:1551-7 (2002)  
Target
Name:
Carbonic anhydrase 4
Synonyms:
CA-IV CAH4_BOVIN Carbonic Anhydrase IV Carbonic anhydrase 4
Type:
Enzyme
Mol. Mass.:
35152.74
Organism:
Bos taurus (bovine)
Description:
Bovine isozyme, isolated from lung microsomes
Residue:
312
  
Inhibitor
Name:
BDBM10885
Synonyms:
(4R)-4-(ethylamino)-2-(3-methoxypropyl)-1,1-dioxo-2H,3H,4H-1,7,2-thieno[3,2-e][1,2]thiazine-6-sulfonamide AL-4862 Brinzolamide (BRZ) | brinzolamide
Type:
Small organic molecule
Emp. Form.:
C12H21N3O5S3
Mol. Mass.:
383.507
SMILES:
CCN[C@H]1CN(CCCOC)S(=O)(=O)c2sc(cc12)S(N)(=O)=O
: