Target
4-hydroxyphenylpyruvate dioxygenase
Ligand
BDBM50075318
Substrate
Meas. Tech.
ChEMBL_541 (CHEMBL857062)
IC50
50±n/a nM
Citation
 Huang, MYang, DYShang, ZZou, JYu, Q 3D-QSAR studies on 4-hydroxyphenylpyruvate dioxygenase inhibitors by comparative molecular field analysis (CoMFA). Bioorg Med Chem Lett 12:2271-5 (2002)  
Target
Name:
4-hydroxyphenylpyruvate dioxygenase
Synonyms:
HPD | HPPD_PIG
Type:
PROTEIN
Mol. Mass.:
45064.25
Organism:
Sus scrofa
Description:
ChEMBL_541
Residue:
393
  
Inhibitor
Name:
BDBM50075318
Synonyms:
2-(2-Chloro-4-methanesulfonyl-benzoyl)-3-hydroxy-cyclohex-2-enone | CHEMBL73467
Type:
Small organic molecule
Emp. Form.:
C14H13ClO5S
Mol. Mass.:
328.768
SMILES:
CS(=O)(=O)c1ccc(C(=O)C2C(=O)CCCC2=O)c(Cl)c1
: