Target
Neuronal acetylcholine receptor subunit alpha-7
Ligand
BDBM50060582
Substrate
Meas. Tech.
ChEBML_144178
Ki
>100000±n/a nM
Citation
 Ayers, JTDwoskin, LPDeaciuc, AGGrinevich, VPZhu, JCrooks, PA bis-Azaaromatic quaternary ammonium analogues: ligands for alpha4beta2* and alpha7* subtypes of neuronal nicotinic receptors. Bioorg Med Chem Lett 12:3067-71 (2002)  
Target
Name:
Neuronal acetylcholine receptor subunit alpha-7
Synonyms:
ACHA7_RAT Cholinergic, Nicotinic Alpha7 Chrna7 Neuronal acetylcholine receptor (alpha7 nAChR) Neuronal acetylcholine receptor subunit alpha-7 Neuronal acetylcholine receptor subunit alpha-7 (nAChR)
Type:
Enzyme
Mol. Mass.:
56502.44
Organism:
Rattus norvegicus (Rat)
Description:
Q05941
Residue:
502
  
Inhibitor
Name:
BDBM50060582
Synonyms:
1,10-Bis(trimethyl ammonium)decane dibromide CHEMBL1134 DECAMETHONIUM BROMIDE N,N,N'',N''-Tetramethyl-decane-1,10-diammonium; dibromide Syncurine | decane-1,10-bis(trimethylammonium bromide)
Type:
Small organic molecule
Emp. Form.:
C16H38N2
Mol. Mass.:
258.4852
SMILES:
C[N+](C)(C)CCCCCCCCCC[N+](C)(C)C
: