Target
Adenosylhomocysteinase
Ligand
BDBM82524
Substrate
Meas. Tech.
ChEBML_196565
Ki
104700±n/a nM
Citation
 Steere, JASampson, PBHonek, JF Synthesis of an alpha-aminophosphonate nucleoside as an inhibitor of S-adenosyl-L-homocysteine hydrolase. Bioorg Med Chem Lett 12:457-60 (2002)  
Target
Name:
Adenosylhomocysteinase
Synonyms:
Adenosylhomocysteinase SAHH_RAT
Type:
PROTEIN
Mol. Mass.:
47537.52
Organism:
Rattus norvegicus
Description:
ChEMBL_1507790
Residue:
432
  
Inhibitor
Name:
BDBM82524
Synonyms:
5'-Deoxy-5'-isobutylthioadenosine CAS_35899-54-8
Type:
Small organic molecule
Emp. Form.:
C14H21N5O3S
Mol. Mass.:
339.413
SMILES:
CC(C)CSC[C@H]1O[C@H]([C@H](O)[C@@H]1O)n1cnc2c(N)ncnc12
: