Target
Mandelate racemase
Ligand
BDBM50080274
Substrate
Meas. Tech.
ChEBML_105194
pH
7.5±n/a
Ki
3600000±n/a nM
Comments
extracted
Citation
 St Maurice, MBearne, SLLu, WTaylor, SD Inhibition of mandelate racemase by alpha-fluorobenzylphosphonates. Bioorg Med Chem Lett 13:2041-4 (2003)  
Target
Name:
Mandelate racemase
Synonyms:
MANR_PSEPU Mandelate racemase (MR) | mdlA
Type:
Protein
Mol. Mass.:
38561.77
Organism:
Pseudomonas putida (g-Proteobacteria)
Description:
Residue:
359
  
Inhibitor
Name:
BDBM50080274
Synonyms:
Benzyl-phosphonic acid Phenyl-methanephosphonic acid anion | benzylphosphonic acid
Type:
Small organic molecule
Emp. Form.:
C7H9O3P
Mol. Mass.:
172.1183
SMILES:
OP(O)(=O)Cc1ccccc1
: