Target
cGMP-dependent 3',5'-cyclic phosphodiesterase
Ligand
BDBM50100662
Substrate
Meas. Tech.
ChEBML_156305
IC50
9700±n/a nM
Citation
 Ukita, TNakamura, YKubo, AYamamoto, YMoritani, YSaruta, KHigashijima, TKotera, JFujishige, KTakagi, MKikkawa, KOmori, K 1,7- and 2,7-naphthyridine derivatives as potent and highly specific PDE5 inhibitors. Bioorg Med Chem Lett 13:2341-5 (2003)  
Target
Name:
cGMP-dependent 3',5'-cyclic phosphodiesterase
Synonyms:
PDE2A Phosphodiesterase 2A
Type:
PROTEIN
Mol. Mass.:
103200.18
Organism:
Bos taurus
Description:
ChEMBL_154420
Residue:
921
  
Inhibitor
Name:
BDBM50100662
Synonyms:
CHEMBL553371 methyl 2-(4-aminophenyl)-1-oxo-7-(2-pyridylmethoxy)-4-(3,4,5-trimethoxyphenyl)-1,2-dihydro-3-isoquinolinecarboxylate.dihydrochloride
Type:
Small organic molecule
Emp. Form.:
C32H29N3O7
Mol. Mass.:
567.5886
SMILES:
COC(=O)c1c(-c2cc(OC)c(OC)c(OC)c2)c2ccc(OCc3ccccn3)cc2c(=O)n1-c1ccc(N)cc1
: