Target
M1 family aminopeptidase
Ligand
BDBM50131276
Substrate
Meas. Tech.
ChEBML_217776
IC50
854±n/a nM
Citation
 Flipo, MFlorent, IGrellier, PSergheraert, CDeprez-Poulain, R Design, synthesis and antimalarial activity of novel, quinoline-based, zinc metallo-aminopeptidase inhibitors. Bioorg Med Chem Lett 13:2659-62 (2003)  
Target
Name:
M1 family aminopeptidase
Synonyms:
AMPN_PLAF7 Zinc aminopeptidase | m1-family aminopeptidase
Type:
PROTEIN
Mol. Mass.:
126072.31
Organism:
Plasmodium falciparum (isolate FcB1 / Columbia)
Description:
ChEMBL_735637
Residue:
1085
  
Inhibitor
Name:
BDBM50131276
Synonyms:
CHEMBL328470 | N-(3-{4-[3-(7-Chloro-quinolin-4-ylamino)-propyl]-piperazin-1-yl}-propyl)-N'-hydroxy-N-isobutyl-malonamide
Type:
Small organic molecule
Emp. Form.:
C26H39ClN6O3
Mol. Mass.:
519.079
SMILES:
CC(C)CN(CCCN1CCN(CCCNc2ccnc3cc(Cl)ccc23)CC1)C(=O)CC(=O)NO
: