Target
Potassium voltage-gated channel subfamily H member 2
Ligand
BDBM50022889
Substrate
Meas. Tech.
ChEMBL_158540 (CHEMBL766814)
IC50
5623±n/a nM
Citation
 Keserü, GM Prediction of hERG potassium channel affinity by traditional and hologram qSAR methods. Bioorg Med Chem Lett 13:2773-5 (2003)  
Target
Name:
Potassium voltage-gated channel subfamily H member 2
Synonyms:
1,3-beta-glucan synthase component GLS2 ERG Eag-related protein 1 Ether-a-go-go-related gene (HERG) Ether-a-go-go-related gene potassium channel 1 Ether-a-go-go-related gene potassium channel 1 (hERG1) Ether-a-go-go-related protein 1 H-ERG KCNH2 Potassium voltage-gated channel subfamily H member 2 (hERG) Voltage-gated potassium channel subunit Kv11.1 hERG Potassium Channel 1 | putative potassium channel subunit
Type:
Multi-pass membrane protein
Mol. Mass.:
126672.65
Organism:
Homo sapiens (Human)
Description:
Q12809
Residue:
1159
  
Inhibitor
Name:
BDBM50022889
Synonyms:
(2,8-Bis-trifluoromethyl-quinolin-4-yl)-(1-methyl-piperidin-2-yl)-methanol (2,8-Bis-trifluoromethyl-quinolin-4-yl)-piperidin-2-yl-methanol( Mefloquine) (2,8-bis(trifluoromethyl)quinolin-4-yl)(piperidin-2-yl)methanol (S)-(2,8-Bis-trifluoromethyl-quinolin-4-yl)-piperidin-2-yl-methanol 2,8-di(trifluoromethyl)-4-quinolyl-hexahydro-2-pyridinylmethanol(Mefloquine) CHEMBL416956 Lariam [2,8-bis(trifluoromethyl)quinolin-4-yl]-(2-piperidyl)methanol melfoquine rel-(2,8-bis(trifluoromethyl)quinolin-4-yl)(piperidin-2-yl)methanol
Type:
Small organic molecule
Emp. Form.:
C17H16F6N2O
Mol. Mass.:
378.3122
SMILES:
OC(C1CCCCN1)c1cc(nc2c(cccc12)C(F)(F)F)C(F)(F)F
: