Target
Methionine--tRNA ligase, cytoplasmic
Ligand
BDBM50366861
Substrate
Meas. Tech.
ChEBML_105279
IC50
1100±n/a nM
Citation
 Lee, JKim, SELee, JYKim, SYKang, SUSeo, SHChun, MWKang, TChoi, SYKim, HO N-Alkoxysulfamide, N-hydroxysulfamide, and sulfamate analogues of methionyl and isoleucyl adenylates as inhibitors of methionyl-tRNA and isoleucyl-tRNA synthetases. Bioorg Med Chem Lett 13:1087-92 (2003)  
Target
Name:
Methionine--tRNA ligase, cytoplasmic
Synonyms:
MARS Methionyl-tRNA synthetase | SYMC_HUMAN
Type:
PROTEIN
Mol. Mass.:
101110.04
Organism:
Homo sapiens (Human)
Description:
ChEMBL_105283
Residue:
900
  
Inhibitor
Name:
BDBM50366861
Synonyms:
CHEMBL605595
Type:
Small organic molecule
Emp. Form.:
C17H23N7O7S2
Mol. Mass.:
501.537
SMILES:
CSCC[C@H](N)C(=O)NS(=O)(=O)OC[C@H]1OC([C@H](O)[C@@H]1O)n1cnc2c(N)nc(nc12)C#C
: