Target
Fatty acid synthase
Ligand
BDBM50142502
Substrate
Meas. Tech.
ChEBML_68769
Ki
50000±n/a nM
Citation
 Guérard, CBréard, MCourtois, FDrujon, TPloux, O Synthesis and evaluation of analogues of S-adenosyl-L-methionine, as inhibitors of the E. coli cyclopropane fatty acid synthase. Bioorg Med Chem Lett 14:1661-4 (2004)  
Target
Name:
Fatty acid synthase
Synonyms:
FAS FAS_HUMAN HU FASN
Type:
Enzyme
Mol. Mass.:
273419.37
Organism:
Homo sapiens (Human)
Description:
P49327
Residue:
2511
  
Inhibitor
Name:
BDBM50142502
Synonyms:
2-Amino-4-[(2S,3S,4R,5R)-5-(6-amino-purin-9-yl)-3,4-dihydroxy-tetrahydro-furan-2-ylmethanesulfinyl]-butyric acid | CHEMBL46902
Type:
Small organic molecule
Emp. Form.:
C14H20N6O6S
Mol. Mass.:
400.41
SMILES:
N[C@@H](CCS(=O)C[C@H]1O[C@H]([C@H](O)[C@@H]1O)n1cnc2c(N)ncnc12)C(O)=O
: