Target
Tyrosine-protein phosphatase 1
Ligand
BDBM50366943
Substrate
Meas. Tech.
ChEBML_217570
IC50
7400±n/a nM
Citation
 Shrestha, SShim, YSKim, KCLee, KHCho, H Evans Blue and other dyes as protein tyrosine phosphatase inhibitors. Bioorg Med Chem Lett 14:1923-6 (2004)  
Target
Name:
Tyrosine-protein phosphatase 1
Synonyms:
PTP1 Protein-tyrosine phosphatase 1
Type:
PROTEIN
Mol. Mass.:
38875.77
Organism:
Saccharomyces cerevisiae
Description:
ChEMBL_217570
Residue:
335
  
Inhibitor
Name:
BDBM50366943
Synonyms:
TRYPAN BLUE
Type:
Small organic molecule
Emp. Form.:
C34H24N6O14S4
Mol. Mass.:
868.848
SMILES:
Cc1cc(ccc1N=Nc1c(O)c2c(N)cc(cc2cc1S([O-])(=O)=O)S([O-])(=O)=O)-c1ccc(N=Nc2c(O)c3c(N)cc(cc3cc2S([O-])(=O)=O)S([O-])(=O)=O)c(C)c1
: