Target
Tyrosine-protein phosphatase non-receptor type 1
Ligand
BDBM50366944
Substrate
Meas. Tech.
ChEBML_154471
IC50
1300±n/a nM
Citation
 Shrestha, SShim, YSKim, KCLee, KHCho, H Evans Blue and other dyes as protein tyrosine phosphatase inhibitors. Bioorg Med Chem Lett 14:1923-6 (2004)  
Target
Name:
Tyrosine-protein phosphatase non-receptor type 1
Synonyms:
PTN1_HUMAN PTPN1 Protein tyrosine phosphatase-1B (PTP1B) Protein-tyrosine phosphatase 1B (PTP1B) Tyrosine-protein phosphatase non-receptor type 1 (PTP1B)
Type:
Protein phosphatase
Mol. Mass.:
49963.76
Organism:
Homo sapiens (Human)
Description:
Human recombinant GST-fusion PTP1B (1-435).
Residue:
435
  
Inhibitor
Name:
BDBM50366944
Synonyms:
Azovan Blue EVANS BLUE
Type:
Small organic molecule
Emp. Form.:
C34H24N6O14S4
Mol. Mass.:
868.848
SMILES:
Cc1cc(ccc1N=Nc1ccc2c(cc(c(N)c2c1O)S([O-])(=O)=O)S([O-])(=O)=O)-c1ccc(N=Nc2ccc3c(cc(c(N)c3c2O)S([O-])(=O)=O)S([O-])(=O)=O)c(C)c1
: